Error on installing dependencies

I am getting following error on installing the
dependencies for rt Data Dumper Package
Any help
Thanks
Niranjan

rm -f blib/arch/auto/Data/Dumper/Dumper.so
LD_RUN_PATH="" gcc -G Dumper.o -o
blib/arch/auto/Data/Dumper/Dumper.so
chmod 755 blib/arch/auto/Data/Dumper/Dumper.so
cp Dumper.bs blib/arch/auto/Data/Dumper/Dumper.bs
chmod 644 blib/arch/auto/Data/Dumper/Dumper.bs
PERL_DL_NONLAZY=1
/homes/woprf/n/niranjan/Perl/bin/perl
“-MExtUtils::Command::MM” “-e” “test_harness(0,
‘blib/lib’, ‘blib/arch’)” t/*.t
t/dumper…NOK 103Use of uninitialized value in
string eq at t/dumper.t line 18.
Use of uninitialized value in concatenation (.) or
string at t/dumper.t line 18.
Use of uninitialized value in string at t/dumper.t
line 22.
Use of uninitialized value in string eq at t/dumper.t
line 27.
Use of uninitialized value in concatenation (.) or
string at t/dumper.t line 27.
Use of uninitialized value in string eq at t/dumper.t
line 18.
Use of uninitialized value in concatenation (.) or
string at t/dumper.t line 18.
Use of uninitialized value in string at t/dumper.t
line 22.
Use of uninitialized value in string eq at t/dumper.t
line 27.
Use of uninitialized value in concatenation (.) or
string at t/dumper.t line 27.
Use of uninitialized value in string eq at t/dumper.t
line 18.
Use of uninitialized value in concatenation (.) or
string at t/dumper.t line 18.
Use of uninitialized value in string at t/dumper.t
line 22.
Use of uninitialized value in string eq at t/dumper.t
line 27.
Use of uninitialized value in concatenation (.) or
string at t/dumper.t line 27.
t/dumper…FAILED tests 1, 3-4, 6-7, 9-10, 12-13,
15-16, 18-19, 21-22, 24-25, 27-28, 30-31, 33-34,
36-37, 39-40, 42, 49, 51-52, 54-55, 57-58, 60-61,
63-64, 66-67, 69-70, 72-73, 75-76, 78-79, 81-82,
84-85, 87-88, 90, 97, 99-100, 102-103, 105-106,
108-109, 111-112, 114-115, 117-118, 120, 145, 147,
151, 153, 157, 159
Failed 78/162 tests, 51.85% okay
t/overload…ok

Failed Test Stat Wstat Total Fail Failed List of
Failed
t/dumper.t 162 78 48.15% 1 3-4 6-7
9-10 12-13 15-16 18-19 21-
22 24-25
27-28 30-31 33-34 36-37 39-
40 42 49
51-52 54-55 57-58 60-61 63-
64 66-67
69-70 72-73 75-76 78-79 81-
82 84-85
87-88 90 97 99-100 102-103
105-106
108-109 111-112 114-115 117-
118 120 145
147 151 153 157 159
Failed 1/2 test scripts, 50.00% okay. 78/163 subtests
failed, 52.15% okay.
make: *** [test_dynamic] Error 29

Do you Yahoo!?
Yahoo! News - Today’s headlines

Hi all,

I get the following error from installing the Data Dumper module. Does this
happen to anyone of you before? Thanks for your time.

PERL_DL_NONLAZY=1 /usr/bin/perl “-MExtUtils::Command::MM” “-e”
“test_harness(0, ‘blib/lib’, ‘blib/arch’)” t/*.t
t/dumper…NOK 57Use of uninitialized value in string eq at t/dumper.t
line 18.
Use of uninitialized value in concatenation (.) or string at t/dumper.t line
18.
Use of uninitialized value in string at t/dumper.t line 22.
Use of uninitialized value in string eq at t/dumper.t line 27.
Use of uninitialized value in concatenation (.) or string at t/dumper.t line
27.
Use of uninitialized value in string eq at t/dumper.t line 18.
Use of uninitialized value in concatenation (.) or string at t/dumper.t line
18.
Use of uninitialized value in string at t/dumper.t line 22.
Use of uninitialized value in string eq at t/dumper.t line 27.
Use of uninitialized value in concatenation (.) or string at t/dumper.t line
27.
Use of uninitialized value in string eq at t/dumper.t line 18.
Use of uninitialized value in concatenation (.) or string at t/dumper.t line
18.
Use of uninitialized value in string at t/dumper.t line 22.
Use of uninitialized value in string eq at t/dumper.t line 27.
Use of uninitialized value in concatenation (.) or string at t/dumper.t line
27.
t/dumper…FAILED tests 1, 3-4, 6-7, 9-10, 12-13, 15-16, 18-19, 21, 25,
27-28, 30-31, 33-34, 36-37, 39-40, 42-43, 45, 49, 51-52, 54-55, 57-58, 60,
73, 75-76, 78-79, 81
Failed 42/81 tests, 48.15% okay
t/overload…ok
Failed Test Stat Wstat Total Fail Failed List of Failed
t/dumper.t 81 42 51.85% 1 3-4 6-7 9-10 12-13 15-16 18-19
21
25 27-28 30-31 33-34 36-37 39-40
42-
43 45 49 51-52 54-55 57-58 60 73
75-
76 78-79 81
Failed 1/2 test scripts, 50.00% okay. 42/82 subtests failed, 48.78% okay.
make: *** [test_dynamic] Error 29

Jerry Hsieh

I get the following error from installing the Data Dumper module. Does
this happen to anyone of you before? Thanks for your time.

What version of Perl are you using? Data::Dumper has been standard with
Perl for about 5 years; unless your Perl is ancient, you shouldn’t need
to be installing this.

A pretty good rule of thumb is: If you need to upgrade Data::Dumper,
you need to upgrade Perl.

(darren)

Without deviation from the norm, ‘progress’ is not possible.
– Frank Zappa