Database Initialization Error 2 - but testdeps successful

Hi folks!

I have problems with the installation of RT 3.8.4 on Debian 5.

Running testdeps returns “All dependences have been found”.

My RT_SiteConfig.pm file looks like this:

To include a directive here, just copy the equivalent statement

from RT_Config.pm and change the value. We’ve included a single

sample value below.

This file is actually a perl module, so you can include valid

perl code, as well.

The converse is also true, if this file isn’t valid perl, you’re

going to run into trouble. To check your SiteConfig file, use

this comamnd:

perl -c /path/to/your/etc/RT_SiteConfig.pm

Set( $rtname, ‘rt.vecweb.net’ );
Set( $Organization, ‘vecweb.net’ );
Set( $CorrespondAddress, ‘rt@rt.vecweb.net’ );
Set( $CommentAddress, ‘rt-comment@rt.vecweb.net’ );
Set( $OwnerEmail, ‘root’ );
Set( $MaxAttachmentSize, 10000000 );
Set( $DatabaseType, ‘mysql’ );
Set( $DatabaseUser, ‘root’ );
Set( $DatabasePassword, ‘root’ );
Set( $DatabaseName, ‘rt3’ );
Set( $WebPath, ‘/rt’);
Set( $WebBaseURL, ‘http://rt.vecweb.net’ );

#Set(@Plugins,(qw(Extension::QuickDelete RT::FM)));
1;

When running “make initialize-database” the following errors occur:
debian:/home/user/rt-3.8.4# make initialize-database
/usr/bin/perl sbin/rt-setup-database --action init --dba root --prompt-for-dba-password
Can’t locate Unicode/Map.pm in @INC (@INC contains: /home/user/rt-3.8.4/sbin/…/local/lib /home/user/rt-3.8.4/sbin/…/lib /etc/perl /usr/local/lib/perl/5.10.0 /usr/local/share/perl/5.10.0 /usr/lib/perl5 /usr/share/perl5 /usr/lib/perl/5.10 /usr/share/perl/5.10 /usr/local/lib/site_perl .) at /usr/local/share/perl/5.10.0/MIME/WordDecoder.pm line 376.
BEGIN failed–compilation aborted at /usr/local/share/perl/5.10.0/MIME/WordDecoder.pm line 376.
Compilation failed in require at /usr/local/share/perl/5.10.0/MIME/Parser/Filer.pm line 133.
BEGIN failed–compilation aborted at /usr/local/share/perl/5.10.0/MIME/Parser/Filer.pm line 133.
Compilation failed in require at /usr/local/share/perl/5.10.0/MIME/Parser.pm line 149.
BEGIN failed–compilation aborted at /usr/local/share/perl/5.10.0/MIME/Parser.pm line 149.
Compilation failed in require at /home/user/rt-3.8.4/sbin/…/lib/RT/EmailParser.pm line 60.
BEGIN failed–compilation aborted at /home/user/rt-3.8.4/sbin/…/lib/RT/EmailParser.pm line 60.
Compilation failed in require at /home/user/rt-3.8.4/sbin/…/lib/RT/Interface/Email.pm line 56.
BEGIN failed–compilation aborted at /home/user/rt-3.8.4/sbin/…/lib/RT/Interface/Email.pm line 56.
Compilation failed in require at /home/user/rt-3.8.4/sbin/…/lib/RT/Queue_Overlay.pm line 77.
BEGIN failed–compilation aborted at /home/user/rt-3.8.4/sbin/…/lib/RT/Queue_Overlay.pm line 77.
Compilation failed in require at (eval 1053) line 3.
Compilation failed in require at /home/user/rt-3.8.4/sbin/…/lib/RT/Queues.pm line 76.
BEGIN failed–compilation aborted at /home/user/rt-3.8.4/sbin/…/lib/RT/Queues.pm line 76.
Compilation failed in require at /home/user/rt-3.8.4/sbin/…/lib/RT/ACE_Overlay.pm line 70.
BEGIN failed–compilation aborted at /home/user/rt-3.8.4/sbin/…/lib/RT/ACE_Overlay.pm line 70.
Compilation failed in require at (eval 1052) line 3.
Compilation failed in require at /home/user/rt-3.8.4/sbin/…/lib/RT/ACL.pm line 76.
BEGIN failed–compilation aborted at /home/user/rt-3.8.4/sbin/…/lib/RT/ACL.pm line 76.
Compilation failed in require at /home/user/rt-3.8.4/sbin/…/lib/RT/Group_Overlay.pm line 82.
BEGIN failed–compilation aborted at /home/user/rt-3.8.4/sbin/…/lib/RT/Group_Overlay.pm line 82.
Compilation failed in require at (eval 1034) line 3.
Compilation failed in require at /home/user/rt-3.8.4/sbin/…/lib/RT/Principal_Overlay.pm line 60.
BEGIN failed–compilation aborted at /home/user/rt-3.8.4/sbin/…/lib/RT/Principal_Overlay.pm line 60.
Compilation failed in require at (eval 1033) line 3.
Compilation failed in require at /home/user/rt-3.8.4/sbin/…/lib/RT/Principals.pm line 76.
BEGIN failed–compilation aborted at /home/user/rt-3.8.4/sbin/…/lib/RT/Principals.pm line 76.
Compilation failed in require at /home/user/rt-3.8.4/sbin/…/lib/RT/User_Overlay.pm line 73.
BEGIN failed–compilation aborted at /home/user/rt-3.8.4/sbin/…/lib/RT/User_Overlay.pm line 73.
Compilation failed in require at (eval 1032) line 3.
Compilation failed in require at /home/user/rt-3.8.4/sbin/…/lib/RT/Record.pm line 70.
BEGIN failed–compilation aborted at /home/user/rt-3.8.4/sbin/…/lib/RT/Record.pm line 70.
Compilation failed in require at /home/user/rt-3.8.4/sbin/…/lib/RT/Ticket.pm line 72.
BEGIN failed–compilation aborted at /home/user/rt-3.8.4/sbin/…/lib/RT/Ticket.pm line 72.
Compilation failed in require at /home/user/rt-3.8.4/sbin/…/lib/RT/Tickets.pm line 76.
BEGIN failed–compilation aborted at /home/user/rt-3.8.4/sbin/…/lib/RT/Tickets.pm line 76.
Compilation failed in require at /home/user/rt-3.8.4/sbin/…/lib/RT.pm line 423.
BEGIN failed–compilation aborted at sbin/rt-setup-database line 86.
make: *** [initialize-database] Error 2

Im a totally newbie on Debian or any command line programing. Do you have any suggestions how to get this command running?

Best regards,
Thomas

Hello,

MIME::WordDecoder is indirect dependency. There could be many reasons
why Unicode::Map is not installed on your system.On Thu, Jul 23, 2009 at 1:23 PM, Thomas FluchFluchT@wyeth.com wrote:

Hi folks!

I have problems with the installation of RT 3.8.4 on Debian 5.

Running testdeps returns “All dependences have been found”.

My RT_SiteConfig.pm file looks like this:

To include a directive here, just copy the equivalent statement

from RT_Config.pm and change the value. We’ve included a single

sample value below.

This file is actually a perl module, so you can include valid

perl code, as well.

The converse is also true, if this file isn’t valid perl, you’re

going to run into trouble. To check your SiteConfig file, use

this comamnd:

perl -c /path/to/your/etc/RT_SiteConfig.pm

Set( $rtname, ‘rt.vecweb.net’ );
Set( $Organization, ‘vecweb.net’ );
Set( $CorrespondAddress, ‘rt@rt.vecweb.net’ );
Set( $CommentAddress, ‘rt-comment@rt.vecweb.net’ );
Set( $OwnerEmail, ‘root’ );
Set( $MaxAttachmentSize, 10000000 );
Set( $DatabaseType, ‘mysql’ );
Set( $DatabaseUser, ‘root’ );
Set( $DatabasePassword, ‘root’ );
Set( $DatabaseName, ‘rt3’ );
Set( $WebPath, ‘/rt’);
Set( $WebBaseURL, ‘http://rt.vecweb.net’ );

#Set(@Plugins,(qw(Extension::QuickDelete RT::FM)));
1;

When running “make initialize-database” the following errors occur:
debian:/home/user/rt-3.8.4# make initialize-database
/usr/bin/perl sbin/rt-setup-database --action init --dba root
–prompt-for-dba-password
Can’t locate Unicode/Map.pm in @INC (@INC contains:
/home/user/rt-3.8.4/sbin/…/local/lib /home/user/rt-3.8.4/sbin/…/lib
/etc/perl /usr/local/lib/perl/5.10.0 /usr/local/share/perl/5.10.0
/usr/lib/perl5 /usr/share/perl5 /usr/lib/perl/5.10 /usr/share/perl/5.10
/usr/local/lib/site_perl .) at
/usr/local/share/perl/5.10.0/MIME/WordDecoder.pm line 376.
BEGIN failed–compilation aborted at
/usr/local/share/perl/5.10.0/MIME/WordDecoder.pm line 376.
Compilation failed in require at
/usr/local/share/perl/5.10.0/MIME/Parser/Filer.pm line 133.
BEGIN failed–compilation aborted at
/usr/local/share/perl/5.10.0/MIME/Parser/Filer.pm line 133.
Compilation failed in require at /usr/local/share/perl/5.10.0/MIME/Parser.pm
line 149.
BEGIN failed–compilation aborted at
/usr/local/share/perl/5.10.0/MIME/Parser.pm line 149.
Compilation failed in require at
/home/user/rt-3.8.4/sbin/…/lib/RT/EmailParser.pm line 60.
BEGIN failed–compilation aborted at
/home/user/rt-3.8.4/sbin/…/lib/RT/EmailParser.pm line 60.
Compilation failed in require at
/home/user/rt-3.8.4/sbin/…/lib/RT/Interface/Email.pm line 56.
BEGIN failed–compilation aborted at
/home/user/rt-3.8.4/sbin/…/lib/RT/Interface/Email.pm line 56.
Compilation failed in require at
/home/user/rt-3.8.4/sbin/…/lib/RT/Queue_Overlay.pm line 77.
BEGIN failed–compilation aborted at
/home/user/rt-3.8.4/sbin/…/lib/RT/Queue_Overlay.pm line 77.
Compilation failed in require at (eval 1053) line 3.
Compilation failed in require at
/home/user/rt-3.8.4/sbin/…/lib/RT/Queues.pm line 76.
BEGIN failed–compilation aborted at
/home/user/rt-3.8.4/sbin/…/lib/RT/Queues.pm line 76.
Compilation failed in require at
/home/user/rt-3.8.4/sbin/…/lib/RT/ACE_Overlay.pm line 70.
BEGIN failed–compilation aborted at
/home/user/rt-3.8.4/sbin/…/lib/RT/ACE_Overlay.pm line 70.
Compilation failed in require at (eval 1052) line 3.
Compilation failed in require at /home/user/rt-3.8.4/sbin/…/lib/RT/ACL.pm
line 76.
BEGIN failed–compilation aborted at
/home/user/rt-3.8.4/sbin/…/lib/RT/ACL.pm line 76.
Compilation failed in require at
/home/user/rt-3.8.4/sbin/…/lib/RT/Group_Overlay.pm line 82.
BEGIN failed–compilation aborted at
/home/user/rt-3.8.4/sbin/…/lib/RT/Group_Overlay.pm line 82.
Compilation failed in require at (eval 1034) line 3.
Compilation failed in require at
/home/user/rt-3.8.4/sbin/…/lib/RT/Principal_Overlay.pm line 60.
BEGIN failed–compilation aborted at
/home/user/rt-3.8.4/sbin/…/lib/RT/Principal_Overlay.pm line 60.
Compilation failed in require at (eval 1033) line 3.
Compilation failed in require at
/home/user/rt-3.8.4/sbin/…/lib/RT/Principals.pm line 76.
BEGIN failed–compilation aborted at
/home/user/rt-3.8.4/sbin/…/lib/RT/Principals.pm line 76.
Compilation failed in require at
/home/user/rt-3.8.4/sbin/…/lib/RT/User_Overlay.pm line 73.
BEGIN failed–compilation aborted at
/home/user/rt-3.8.4/sbin/…/lib/RT/User_Overlay.pm line 73.
Compilation failed in require at (eval 1032) line 3.
Compilation failed in require at
/home/user/rt-3.8.4/sbin/…/lib/RT/Record.pm line 70.
BEGIN failed–compilation aborted at
/home/user/rt-3.8.4/sbin/…/lib/RT/Record.pm line 70.
Compilation failed in require at
/home/user/rt-3.8.4/sbin/…/lib/RT/Ticket.pm line 72.
BEGIN failed–compilation aborted at
/home/user/rt-3.8.4/sbin/…/lib/RT/Ticket.pm line 72.
Compilation failed in require at
/home/user/rt-3.8.4/sbin/…/lib/RT/Tickets.pm line 76.
BEGIN failed–compilation aborted at
/home/user/rt-3.8.4/sbin/…/lib/RT/Tickets.pm line 76.
Compilation failed in require at /home/user/rt-3.8.4/sbin/…/lib/RT.pm line
423.
BEGIN failed–compilation aborted at sbin/rt-setup-database line 86.
make: *** [initialize-database] Error 2

Im a totally newbie on Debian or any command line programing. Do you have
any suggestions how to get this command running?

Best regards,
Thomas


http://lists.bestpractical.com/cgi-bin/mailman/listinfo/rt-users

Community help: http://wiki.bestpractical.com
Commercial support: sales@bestpractical.com

Discover RT’s hidden secrets with RT Essentials from O’Reilly Media.
Buy a copy at http://rtbook.bestpractical.com

Best regards, Ruslan.

Hm…during the fixdeps steps I recognized an error regarding the “Core”…MIME Entries…I installed the MIME package (MIME Tools 6.x.x) as described in another Mailing List Archive Mail.

Could this be the reason?

Ruslan Zakirov ruslan.zakirov@gmail.com 2009-07-23 12:07 >>>

Hello,

MIME::WordDecoder is indirect dependency. There could be many reasons
why Unicode::Map is not installed on your system.On Thu, Jul 23, 2009 at 1:23 PM, Thomas FluchFluchT@wyeth.com wrote:

Hi folks!

I have problems with the installation of RT 3.8.4 on Debian 5.

Running testdeps returns “All dependences have been found”.

My RT_SiteConfig.pm file looks like this:

To include a directive here, just copy the equivalent statement

from RT_Config.pm and change the value. We’ve included a single

sample value below.

This file is actually a perl module, so you can include valid

perl code, as well.

The converse is also true, if this file isn’t valid perl, you’re

going to run into trouble. To check your SiteConfig file, use

this comamnd:

perl -c /path/to/your/etc/RT_SiteConfig.pm

Set( $rtname, ‘rt.vecweb.net’ );
Set( $Organization, ‘vecweb.net’ );
Set( $CorrespondAddress, ‘rt@rt.vecweb.net’ );
Set( $CommentAddress, ‘rt-comment@rt.vecweb.net’ );
Set( $OwnerEmail, ‘root’ );
Set( $MaxAttachmentSize, 10000000 );
Set( $DatabaseType, ‘mysql’ );
Set( $DatabaseUser, ‘root’ );
Set( $DatabasePassword, ‘root’ );
Set( $DatabaseName, ‘rt3’ );
Set( $WebPath, ‘/rt’);
Set( $WebBaseURL, ‘http://rt.vecweb.net’ );

#Set(@Plugins,(qw(Extension::QuickDelete RT::FM)));
1;

When running “make initialize-database” the following errors occur:
debian:/home/user/rt-3.8.4# make initialize-database
/usr/bin/perl sbin/rt-setup-database --action init --dba root
–prompt-for-dba-password
Can’t locate Unicode/Map.pm in @INC (@INC contains:
/home/user/rt-3.8.4/sbin/…/local/lib /home/user/rt-3.8.4/sbin/…/lib
/etc/perl /usr/local/lib/perl/5.10.0 /usr/local/share/perl/5.10.0
/usr/lib/perl5 /usr/share/perl5 /usr/lib/perl/5.10 /usr/share/perl/5.10
/usr/local/lib/site_perl .) at
/usr/local/share/perl/5.10.0/MIME/WordDecoder.pm line 376.
BEGIN failed–compilation aborted at
/usr/local/share/perl/5.10.0/MIME/WordDecoder.pm line 376.
Compilation failed in require at
/usr/local/share/perl/5.10.0/MIME/Parser/Filer.pm line 133.
BEGIN failed–compilation aborted at
/usr/local/share/perl/5.10.0/MIME/Parser/Filer.pm line 133.
Compilation failed in require at /usr/local/share/perl/5.10.0/MIME/Parser.pm
line 149.
BEGIN failed–compilation aborted at
/usr/local/share/perl/5.10.0/MIME/Parser.pm line 149.
Compilation failed in require at
/home/user/rt-3.8.4/sbin/…/lib/RT/EmailParser.pm line 60.
BEGIN failed–compilation aborted at
/home/user/rt-3.8.4/sbin/…/lib/RT/EmailParser.pm line 60.
Compilation failed in require at
/home/user/rt-3.8.4/sbin/…/lib/RT/Interface/Email.pm line 56.
BEGIN failed–compilation aborted at
/home/user/rt-3.8.4/sbin/…/lib/RT/Interface/Email.pm line 56.
Compilation failed in require at
/home/user/rt-3.8.4/sbin/…/lib/RT/Queue_Overlay.pm line 77.
BEGIN failed–compilation aborted at
/home/user/rt-3.8.4/sbin/…/lib/RT/Queue_Overlay.pm line 77.
Compilation failed in require at (eval 1053) line 3.
Compilation failed in require at
/home/user/rt-3.8.4/sbin/…/lib/RT/Queues.pm line 76.
BEGIN failed–compilation aborted at
/home/user/rt-3.8.4/sbin/…/lib/RT/Queues.pm line 76.
Compilation failed in require at
/home/user/rt-3.8.4/sbin/…/lib/RT/ACE_Overlay.pm line 70.
BEGIN failed–compilation aborted at
/home/user/rt-3.8.4/sbin/…/lib/RT/ACE_Overlay.pm line 70.
Compilation failed in require at (eval 1052) line 3.
Compilation failed in require at /home/user/rt-3.8.4/sbin/…/lib/RT/ACL.pm
line 76.
BEGIN failed–compilation aborted at
/home/user/rt-3.8.4/sbin/…/lib/RT/ACL.pm line 76.
Compilation failed in require at
/home/user/rt-3.8.4/sbin/…/lib/RT/Group_Overlay.pm line 82.
BEGIN failed–compilation aborted at
/home/user/rt-3.8.4/sbin/…/lib/RT/Group_Overlay.pm line 82.
Compilation failed in require at (eval 1034) line 3.
Compilation failed in require at
/home/user/rt-3.8.4/sbin/…/lib/RT/Principal_Overlay.pm line 60.
BEGIN failed–compilation aborted at
/home/user/rt-3.8.4/sbin/…/lib/RT/Principal_Overlay.pm line 60.
Compilation failed in require at (eval 1033) line 3.
Compilation failed in require at
/home/user/rt-3.8.4/sbin/…/lib/RT/Principals.pm line 76.
BEGIN failed–compilation aborted at
/home/user/rt-3.8.4/sbin/…/lib/RT/Principals.pm line 76.
Compilation failed in require at
/home/user/rt-3.8.4/sbin/…/lib/RT/User_Overlay.pm line 73.
BEGIN failed–compilation aborted at
/home/user/rt-3.8.4/sbin/…/lib/RT/User_Overlay.pm line 73.
Compilation failed in require at (eval 1032) line 3.
Compilation failed in require at
/home/user/rt-3.8.4/sbin/…/lib/RT/Record.pm line 70.
BEGIN failed–compilation aborted at
/home/user/rt-3.8.4/sbin/…/lib/RT/Record.pm line 70.
Compilation failed in require at
/home/user/rt-3.8.4/sbin/…/lib/RT/Ticket.pm line 72.
BEGIN failed–compilation aborted at
/home/user/rt-3.8.4/sbin/…/lib/RT/Ticket.pm line 72.
Compilation failed in require at
/home/user/rt-3.8.4/sbin/…/lib/RT/Tickets.pm line 76.
BEGIN failed–compilation aborted at
/home/user/rt-3.8.4/sbin/…/lib/RT/Tickets.pm line 76.
Compilation failed in require at /home/user/rt-3.8.4/sbin/…/lib/RT.pm line
423.
BEGIN failed–compilation aborted at sbin/rt-setup-database line 86.
make: *** [initialize-database] Error 2

Im a totally newbie on Debian or any command line programing. Do you have
any suggestions how to get this command running?

Best regards,
Thomas


http://lists.bestpractical.com/cgi-bin/mailman/listinfo/rt-users

Community help: http://wiki.bestpractical.com
Commercial support: sales@bestpractical.com

Discover RT’s hidden secrets with RT Essentials from O’Reilly Media.
Buy a copy at http://rtbook.bestpractical.com

Best regards, Ruslan.

Hm…during the fixdeps steps I recognized an error regarding the
"Core"…MIME Entries…I installed the MIME package (MIME Tools 6.x.x) as
described in another Mailing List Archive Mail.

Could this be the reason?

May be, don’t know exactly. You don’t give a pointer on the description.

Just install Unicode::Map using cpan shell or whatever you prefer
(debs, manually).

Ruslan Zakirov ruslan.zakirov@gmail.com 2009-07-23 12:07 >>>
Hello,

MIME::WordDecoder is indirect dependency. There could be many reasons
why Unicode::Map is not installed on your system.

Hi folks!

I have problems with the installation of RT 3.8.4 on Debian 5.

Running testdeps returns “All dependences have been found”.

My RT_SiteConfig.pm file looks like this:

To include a directive here, just copy the equivalent statement

from RT_Config.pm and change the value. We’ve included a single

sample value below.

This file is actually a perl module, so you can include valid

perl code, as well.

The converse is also true, if this file isn’t valid perl, you’re

going to run into trouble. To check your SiteConfig file, use

this comamnd:

perl -c /path/to/your/etc/RT_SiteConfig.pm

Set( $rtname, ‘rt.vecweb.net’ );
Set( $Organization, ‘vecweb.net’ );
Set( $CorrespondAddress, ‘rt@rt.vecweb.net’ );
Set( $CommentAddress, ‘rt-comment@rt.vecweb.net’ );
Set( $OwnerEmail, ‘root’ );
Set( $MaxAttachmentSize, 10000000 );
Set( $DatabaseType, ‘mysql’ );
Set( $DatabaseUser, ‘root’ );
Set( $DatabasePassword, ‘root’ );
Set( $DatabaseName, ‘rt3’ );
Set( $WebPath, ‘/rt’);
Set( $WebBaseURL, ‘http://rt.vecweb.net’ );

#Set(@Plugins,(qw(Extension::QuickDelete RT::FM)));
1;

When running “make initialize-database” the following errors occur:
debian:/home/user/rt-3.8.4# make initialize-database
/usr/bin/perl sbin/rt-setup-database --action init --dba root
–prompt-for-dba-password
Can’t locate Unicode/Map.pm in @INC (@INC contains:
/home/user/rt-3.8.4/sbin/…/local/lib /home/user/rt-3.8.4/sbin/…/lib
/etc/perl /usr/local/lib/perl/5.10.0 /usr/local/share/perl/5.10.0
/usr/lib/perl5 /usr/share/perl5 /usr/lib/perl/5.10 /usr/share/perl/5.10
/usr/local/lib/site_perl .) at
/usr/local/share/perl/5.10.0/MIME/WordDecoder.pm line 376.
BEGIN failed–compilation aborted at
/usr/local/share/perl/5.10.0/MIME/WordDecoder.pm line 376.
Compilation failed in require at
/usr/local/share/perl/5.10.0/MIME/Parser/Filer.pm line 133.
BEGIN failed–compilation aborted at
/usr/local/share/perl/5.10.0/MIME/Parser/Filer.pm line 133.
Compilation failed in require at
/usr/local/share/perl/5.10.0/MIME/Parser.pm
line 149.
BEGIN failed–compilation aborted at
/usr/local/share/perl/5.10.0/MIME/Parser.pm line 149.
Compilation failed in require at
/home/user/rt-3.8.4/sbin/…/lib/RT/EmailParser.pm line 60.
BEGIN failed–compilation aborted at
/home/user/rt-3.8.4/sbin/…/lib/RT/EmailParser.pm line 60.
Compilation failed in require at
/home/user/rt-3.8.4/sbin/…/lib/RT/Interface/Email.pm line 56.
BEGIN failed–compilation aborted at
/home/user/rt-3.8.4/sbin/…/lib/RT/Interface/Email.pm line 56.
Compilation failed in require at
/home/user/rt-3.8.4/sbin/…/lib/RT/Queue_Overlay.pm line 77.
BEGIN failed–compilation aborted at
/home/user/rt-3.8.4/sbin/…/lib/RT/Queue_Overlay.pm line 77.
Compilation failed in require at (eval 1053) line 3.
Compilation failed in require at
/home/user/rt-3.8.4/sbin/…/lib/RT/Queues.pm line 76.
BEGIN failed–compilation aborted at
/home/user/rt-3.8.4/sbin/…/lib/RT/Queues.pm line 76.
Compilation failed in require at
/home/user/rt-3.8.4/sbin/…/lib/RT/ACE_Overlay.pm line 70.
BEGIN failed–compilation aborted at
/home/user/rt-3.8.4/sbin/…/lib/RT/ACE_Overlay.pm line 70.
Compilation failed in require at (eval 1052) line 3.
Compilation failed in require at /home/user/rt-3.8.4/sbin/…/lib/RT/ACL.pm
line 76.
BEGIN failed–compilation aborted at
/home/user/rt-3.8.4/sbin/…/lib/RT/ACL.pm line 76.
Compilation failed in require at
/home/user/rt-3.8.4/sbin/…/lib/RT/Group_Overlay.pm line 82.
BEGIN failed–compilation aborted at
/home/user/rt-3.8.4/sbin/…/lib/RT/Group_Overlay.pm line 82.
Compilation failed in require at (eval 1034) line 3.
Compilation failed in require at
/home/user/rt-3.8.4/sbin/…/lib/RT/Principal_Overlay.pm line 60.
BEGIN failed–compilation aborted at
/home/user/rt-3.8.4/sbin/…/lib/RT/Principal_Overlay.pm line 60.
Compilation failed in require at (eval 1033) line 3.
Compilation failed in require at
/home/user/rt-3.8.4/sbin/…/lib/RT/Principals.pm line 76.
BEGIN failed–compilation aborted at
/home/user/rt-3.8.4/sbin/…/lib/RT/Principals.pm line 76.
Compilation failed in require at
/home/user/rt-3.8.4/sbin/…/lib/RT/User_Overlay.pm line 73.
BEGIN failed–compilation aborted at
/home/user/rt-3.8.4/sbin/…/lib/RT/User_Overlay.pm line 73.
Compilation failed in require at (eval 1032) line 3.
Compilation failed in require at
/home/user/rt-3.8.4/sbin/…/lib/RT/Record.pm line 70.
BEGIN failed–compilation aborted at
/home/user/rt-3.8.4/sbin/…/lib/RT/Record.pm line 70.
Compilation failed in require at
/home/user/rt-3.8.4/sbin/…/lib/RT/Ticket.pm line 72.
BEGIN failed–compilation aborted at
/home/user/rt-3.8.4/sbin/…/lib/RT/Ticket.pm line 72.
Compilation failed in require at
/home/user/rt-3.8.4/sbin/…/lib/RT/Tickets.pm line 76.
BEGIN failed–compilation aborted at
/home/user/rt-3.8.4/sbin/…/lib/RT/Tickets.pm line 76.
Compilation failed in require at /home/user/rt-3.8.4/sbin/…/lib/RT.pm
line
423.
BEGIN failed–compilation aborted at sbin/rt-setup-database line 86.
make: *** [initialize-database] Error 2

Im a totally newbie on Debian or any command line programing. Do you have
any suggestions how to get this command running?

Best regards,
Thomas


http://lists.bestpractical.com/cgi-bin/mailman/listinfo/rt-users

Community help: http://wiki.bestpractical.com
Commercial support: sales@bestpractical.com

Discover RT’s hidden secrets with RT Essentials from O’Reilly Media.
Buy a copy at http://rtbook.bestpractical.com


Best regards, Ruslan.

Best regards, Ruslan.