Apache::Session 1.53, Apache::Request, WWW:: Mecha nize, DBD::mysql 2.1018...MISSING

I had the same problem previously. Go to http://search.cpan.org and
download the module install files and manually install them. The
missing
modules may have their own dependencies so remember to read the README
that
comes with each module. Good luck.

Here are the links:
http://search.cpan.org/dist/Apache-Session/ for Apache::Session 1.53
http://search.cpan.org/author/JOESUF/libapreq-1.2/ for Apache::Request
http://search.cpan.org/author/PETDANCE/WWW-Mechanize-0.56/ for
WWW::Mechanize
http://search.cpan.org/author/RUDY/DBD-mysql-2.9002/ for DBD::mysql

Good luck

Charles Okochu
Snr. Network Engineer
MLBAM
Office: (212) 485-3473
Cell: (646) 996-3272 / (917) 518-5941-----Original Message-----
From: Randy Millis [mailto:rmillisl@gdcanada.com]
Sent: Thursday, July 31, 2003 4:26 PM
To: rt-users@lists.fsck.com
Subject: [rt-users] Apache::Session 1.53, Apache::Request, WWW::
Mechanize,
DBD::mysql 2.1018…MISSING

if I run “perl sbin/rt-test-dependencies --with-mysql --with-modperl1 |
grep MISSING”

I discover the following are missing:

    Apache::Session 1.53...MISSING
    Apache::Request ...MISSING
    WWW::Mechanize ...MISSING
    DBD::mysql 2.1018...MISSING

However running “perl
bin/rt-test-dependencies --with-mysql --with-modperl1 --install” still
fails to install these modules.

If I install from the CPAN shell I get the following errors (cut here to
fit )and need some help resolving this:

-cut-

cpan> install Apache::Session

[…]
Failed 2/18 test scripts, 88.89% okay. 0/89 subtests failed, 100.00%
okay.
make: *** [test_dynamic] Error 29
/opt/sfw/bin/make test – NOT OK
Running make install
make test had returned bad status, won’t install without force

[…]
FAILED–1 test script could be run, alas–no output ever seen
make: *** [test_dynamic] Error 2
/opt/sfw/bin/make test – NOT OK
Running make install
make test had returned bad status, won’t install without force

[…]
Failed 1/25 test scripts, 96.00% okay. 2/266 subtests failed, 99.25%
okay.
make: *** [test_dynamic] Error 29
/opt/sfw/bin/make test – NOT OK
Running make install
make test had returned bad status, won’t install without force’

install DBD::mysql
Running install for module DBD::mysql
Running make for R/RU/RUDY/DBD-mysql-2.9002.tar.gz
Is already unwrapped into directory /.cpan/build/DBD-mysql-2.9002
Makefile.PL returned status 512
Running make test
Make had some problems, maybe interrupted? Won’t test
Running make install
Make had some problems, maybe interrupted? Won’t install

-cut-

OS is Solaris 9.

rt-users mailing list
rt-users@lists.fsck.com
http://lists.fsck.com/mailman/listinfo/rt-users

Have you read the FAQ? The RT FAQ Manager lives at http://fsck.com/rtfm

[INFO] – Virus Manager:
No Viruses were detected in this message.

Want To Win World Series Tickets for Life?!
Do you have the winning hologram?
Watch the 2003 World Series on FOX.*

Major League Baseball Ultimate World Series Pass presented by
RadioShack.
For more information go to http://www.mlb.com/ultimatepass

*MLBI affiliate in Puerto Rico and Canada (check your local television
listing for games, dates and times)